Jump to content
Fórum Script Brasil

vicius_wolf

Membros
  • Content Count

    21
  • Joined

  • Last visited

Everything posted by vicius_wolf

  1. Olá a todos, Estou tentando criando um gráfico no Crystal Reports em um sub relatório (.rpt) através de parâmetros vindos do relatório principal. São só três campos numéricos e já estão no sub relatório, porém não habilita a opção de criação de gráficos. A origem de dos dados é de uma conexão ADO com um banco Oracle. O Crystal só deixa criar gráficos por campos de tabelas? porque só com parâmetros não habilita. Grato pela ajuda desde já.
  2. Boa noite, Preciso executar uma consulta SQL no banco Mysql pelo PHP, da seguinte forma: // Inclui o arquivo que faz a conexão ao banco de dados require_once('mysqli.php'); //Recebe operador com string. $controle = "<"; // Monta a consulta SQL $sql = 'SELECT * FROM `usuarios` WHERE carga "{$controle}" 100; ?> Quero passar o operador lógico menor "<" pela variável controle, como opção de consulta, mas não está funcioanado, poderiam me ajudar? PS.: Já tentei com aspas simples e sem colchete.
  3. Olá pessoal, e mais uma dúvida, e agora é JavaScript, É o seguinte, tem um formulário pra reserva de materiais em PHP, e no campo para inserir a data, quero colocar um calendário em JavaScript para facilitar a vida. Até já consegui um calendário na net, mas não sei como inserir na minha página, no campo destinado a data. Segue o trecho do meu form, do jeito que está agora. <form name="frm" method="POST" action="<? echo $_SERVER[PHP_SELF] . "?acao=$acao"; ?>" onsubmit="return validar_form(this);"> Data da Reserva*<br /> [b] [color="#FF0000"]<inpu
  4. Ok, muito obrigado pela ajuda!
  5. Boa noite pessoal, Preciso de uma força para resolver um problema. Tenho um script mysql para um sistema de reservas, e ele possivelmente foi feito em uma versão anterior a do mysql 5.5, e está criticando o seguinte erro ao criar uma tabela no banco: #1064 - You have an error in your SQL syntax; check the manual that corresponds to your MySQL server version for the right syntax to use near 'type=InnoDB' at line 9 Tradução # 1064 - Você tem um erro em sua sintaxe SQL; verifique o manual que corresponde à sua versão do servidor MySQL para a sintaxe direita ao uso próximo "type = InnoDB 'na lin
  6. vicius_wolf

    Herança em C++

    Senhores, voltando a tirar dúvidas, É o seguinte, estou criando um jogo de corriada bem simples em C++, e estou implementado herança de Polimorfismo. Só que não consigo indentificar o erro que ocorre ao criar uma subclasse. Abaixo está a superclasse, e em seguida a subclasse, só as .h Superclasse figura.h #ifndef FIGURA_H #define FIGURA_H //#include "Quadrado.h" //#include "Circulo.h" class Figura { float x,y; Figura *objeto; public: Figura (float x, float y); void *getObjeto(); virtual void draw(); }; #endif Subclasse quadrado.h #ifndef QUADRADO_H
  7. Saudações colegas do forúm, É o seguite, estou implementando uma simulação de uma lanchonete, e na minha MAIN, estou usando um laço DO WHILE para ficar rodando enquanto pressiono alguma tecla, mas o que está acontecendo e que aparece o primeiro laço, e não continua, cai fora e termina o programa: Segue o codigo: #include <cstdlib> #include <iostream> //#include "fila.h" #include "montador.h" #include <stdlib.h> #include <time.h> using namespace std; int main() { filaCircularComVetor filaDePedidos,filaDeMontagem; pedido pedidos; montador montadores[2];
  8. vicius_wolf

    Arvores B*

    Olá, você quer dizer arvores binárias? Se for posso ajudar!
  9. Achei o erro, danado, e o desgramado do ';' no final da classe! Só valeu outra vez Myho. Obrigado
  10. Boa noite pessoal! (outra vez) Não consigo corrigir o erro a seguir, criei uma nova classe, do tipo montador, e não tinha visto este erro antes. montador.cpp:4: error: new types may not be defined in a return type montador.cpp:4: error: return type specification for constructor invalid e a classe a baixo! #include <iostream> #include "fila.h" class montador { int tempo; bool status; pedido pedidos; public: montador(); bool vazio(); bool ocupado(); pedido montagem(pedido p); friend class pedidos; montador::montador() { tempo = 0; status = false;
  11. Ok, agora "mim inteder", realmente não planejo usar ponteiros, pois ainda não aprendemos. Tua ajuda foi de grande valia. Muito obrigado Myho! Até! Abraços
  12. Opa, obrigado desde já! Sim, o NULL já tentei, mas acusa erro no compilador, algo com 'não escalar'.M as teria com esta função retornar outra coisa, sem ter que testar na main()?
  13. Boa noite pessoal, É o seguinte, estou fazendo um trabalho, onde já emplementei um FILA em C++. Minha dúvida é como eu faça pro o método dequeue(desenfileirar), que é do tipo Pedido, caso a fila esteja vazia, retornar um erro, ou exceção, ou alguma coisa, não sei. Meu codigo a baixo Classe Pedido #include <iostream> using namespace std; class pedido { int controle; int pizza; int pastel; int tempo; public: pedido(); void setControle(int); void setPizza(int); void setPastel(int); void setTempo(int); int getControle(); int getPizza(); i
  14. Valeu mesmo...Olha que olhei pra esse código um tempão e não vi isto.... Quanto ao código tá funcionando, mas não tá jogando a palavra na matriz, vou revisar...se tiver alguma idéia pode mandar.... Se precisar de algo é só avisar... Muito obrigado Nobre amigo!
  15. Nobres colegas, venho pedir socorro! Tenho uma dúvida, que para para muitos possa ser banal, mas é o seguinte: Estou a fazer um jogo de caça-palavras em C, e criei uma procedimento que joga as palavras sorteadas por outra função, dentro da matriz de char, pois bem, criei uma função para sortear numeros de 1 às 5, que serão as posição que a palavra vai ficar na matriz( tipo 1 na horizontal, 2 na vertical...etc). E um erro aparece e não consigo decifar, segue o código a baixo: ERRO: [Linker error] undefined reference to `sorteiaPosicao' ld returned 1 exit status void sorteiaPocisao(i
  16. Foi exatamente o que fiz, criei outra classe ".q4", e inseri na div do domingo, e nada. Mas o interessante é que se mudar os atributos das classes anteriores, funciona, mas dai muda a linha toda....!!!!
  17. Boa tarde pessoal, Sou iniciante em HTML, estou criando um calendário com DIV, está pronto: Tenho estas classes no css: .quad{ border: solid 1px #003399; float:left; } .q1{ font-family:"Comic Sans MS", sans-serif, Verdana; font-weight:bold; background-color:#CCCCCC; border: solid 1px #003399; font-size:30px; height:42px; text-align:center; padding:5px 0 0 5px; } .q2{ font-family:"Comic Sans MS", sans-serif, Verdana; background-color:#FFFFCC; height:20px; width:20px; border: solid 1px #CCCCCC; float:left; } .q3{ font-family:"Comic Sans MS", sans-serif, Verdana
  18. vicius_wolf

    Gtk+ Python 2.6

    Boa tarde, Sou iniciante em python, lendo em foruns a fora, siga as dicas para criar interfaces com python. Baixei a versão 2.6, mais o Gtk+ com Glade. Mas ao dar o comando 'import gtk', na IDLE, aparece este erro: Traceback (most recent call last): File "<pyshell#0>", line 1, in <module> import gtk File "C:\Python26\Lib\site-packages\gtk-2.0\gtk\__init__.py", line 38, in <module> import gobject as _gobject ImportError: No module named gobject Gostaria de saber também se há material de estudo sobre este assunto, e se estou no caminho certo :D Desde, Obrigad
  19. Muito obrigado Mnemonic, como estou no começo, ainda me falta uma pouco de conhecimento sobre o python. Valeu mesmo, até.
  20. É seguinte, no python 3.1, crio uma variavel, "a",depois recebe um valor qualquer, depois dou o comando print para a variavel "a", e mostra o erro. Já digitando a variavel "a", e depois teclando enter aparece o valor da variavel normal. Já fiz um teste com ActivePython 2.6, e funciona das duas maneiras, teclando enter, e o print????
  21. vicius_wolf

    Erro de Sintaxe

    Olá, estou iniciando em Python, e estou com uma dúvida, ao digitar o comando print, para uma variável, o compilador mostra, o seguinte erro "SyntaxError: invalid syntax (<pyshell#21>, line 1)"
×
×
  • Create New...